Jump to content

Register now to gain access to all of our features. Once registered and logged in, you will be able to create topics, post replies to existing threads, give reputation to your fellow members, get your own private messenger, post status updates, manage your profile and so much more. If you already have an account, login here - otherwise create an account for free today!

Make sure that your threads are placed in the correct sections. It saves the Moderation team some work.
Sign in to follow this  
NoNi

HELP SOURCE CODE BUILD

Recommended Posts

1>------ Build started: Project: Engine Hack Base, Configuration: Release Win32 ------
1>ClientDll.cpp
1>C:\Users\kosztapc\Desktop\forUCcheatssources_[unknowncheats.me]_\101xD 3.0\101xD 3.0\Engine Hack Base\ValveSDK\util.h(248,71): warning C4091: 'typedef ': ignored on left of '<unnamed-enum-point_hull>' when no variable is declared
1>C:\Program Files (x86)\Microsoft Visual Studio\2019\Professional\VC\Tools\MSVC\14.25.28610\include\cmath(98,40): error C2062: type 'float' unexpected
1>C:\Program Files (x86)\Microsoft Visual Studio\2019\Professional\VC\Tools\MSVC\14.25.28610\include\cmath(98,40): error C2059: syntax error: 'constant'
1>C:\Program Files (x86)\Microsoft Visual Studio\2019\Professional\VC\Tools\MSVC\14.25.28610\include\cmath(98,40): error C2059: syntax error: ')'
1>C:\Program Files (x86)\Microsoft Visual Studio\2019\Professional\VC\Tools\MSVC\14.25.28610\include\cmath(98,89): error C2143: syntax error: missing ';' before '{'
1>C:\Program Files (x86)\Microsoft Visual Studio\2019\Professional\VC\Tools\MSVC\14.25.28610\include\cmath(98,89): error C2447: '{': missing function header (old-style formal list?)
1>C:\Program Files (x86)\Microsoft Visual Studio\2019\Professional\VC\Tools\MSVC\14.25.28610\include\cmath(332,46): error C2062: type 'long double' unexpected
1>C:\Program Files (x86)\Microsoft Visual Studio\2019\Professional\VC\Tools\MSVC\14.25.28610\include\cmath(332,46): error C2059: syntax error: 'constant'
1>C:\Program Files (x86)\Microsoft Visual Studio\2019\Professional\VC\Tools\MSVC\14.25.28610\include\cmath(332,46): error C2059: syntax error: ')'
1>C:\Program Files (x86)\Microsoft Visual Studio\2019\Professional\VC\Tools\MSVC\14.25.28610\include\cmath(332,101): error C2143: syntax error: missing ';' before '{'
1>C:\Program Files (x86)\Microsoft Visual Studio\2019\Professional\VC\Tools\MSVC\14.25.28610\include\cmath(332,101): error C2447: '{': missing function header (old-style formal list?)
1>C:\Program Files (x86)\Microsoft Visual Studio\2019\Professional\VC\Tools\MSVC\14.25.28610\include\cmath(643,1): error C2146: syntax error: missing ')' before identifier '_Left'
1>C:\Program Files (x86)\Microsoft Visual Studio\2019\Professional\VC\Tools\MSVC\14.25.28610\include\cmath(643,1): error C2365: '_Ty': redefinition; previous definition was 'template parameter'
1>C:\Program Files (x86)\Microsoft Visual Studio\2019\Professional\VC\Tools\MSVC\14.25.28610\include\cmath(643): message : see declaration of '_Ty'
1>C:\Program Files (x86)\Microsoft Visual Studio\2019\Professional\VC\Tools\MSVC\14.25.28610\include\cmath(643,1): error C2061: syntax error: identifier '_Left'
1>C:\Program Files (x86)\Microsoft Visual Studio\2019\Professional\VC\Tools\MSVC\14.25.28610\include\cmath(643,1): error C2059: syntax error: ')'
1>C:\Program Files (x86)\Microsoft Visual Studio\2019\Professional\VC\Tools\MSVC\14.25.28610\include\cmath(643,1): error C2988: unrecognizable template declaration/definition
1>C:\Program Files (x86)\Microsoft Visual Studio\2019\Professional\VC\Tools\MSVC\14.25.28610\include\cmath(643,1): error C2059: syntax error: 'constant'
1>C:\Program Files (x86)\Microsoft Visual Studio\2019\Professional\VC\Tools\MSVC\14.25.28610\include\cmath(643,1): error C2143: syntax error: missing ';' before '{'
1>C:\Program Files (x86)\Microsoft Visual Studio\2019\Professional\VC\Tools\MSVC\14.25.28610\include\cmath(643,1): error C2447: '{': missing function header (old-style formal list?)
1>C:\Users\kosztapc\Desktop\forUCcheatssources_[unknowncheats.me]_\101xD 3.0\101xD 3.0\Engine Hack Base\ClientDll\ClientDll.cpp(153,42): error C3688: invalid literal suffix 'UPD_SCRIPT'; literal operator or literal operator template 'operator ""UPD_SCRIPT' not found
1>C:\Users\kosztapc\Desktop\forUCcheatssources_[unknowncheats.me]_\101xD 3.0\101xD 3.0\Engine Hack Base\ClientDll\ClientDll.cpp(154,33): error C3688: invalid literal suffix 'UPD_HOST'; literal operator or literal operator template 'operator ""UPD_HOST' not found
1>C:\Users\kosztapc\Desktop\forUCcheatssources_[unknowncheats.me]_\101xD 3.0\101xD 3.0\Engine Hack Base\ClientDll\ClientDll.cpp(1679,19): warning C4477: 'sprintf' : format string '%i' requires an argument of type 'int', but variadic argument 2 has type 'double'
1>C:\Users\kosztapc\Desktop\forUCcheatssources_[unknowncheats.me]_\101xD 3.0\101xD 3.0\Engine Hack Base\ClientDll\ClientDll.cpp(1742,19): warning C4477: 'sprintf' : format string '%i' requires an argument of type 'int', but variadic argument 2 has type 'double'
1>C:\Users\kosztapc\Desktop\forUCcheatssources_[unknowncheats.me]_\101xD 3.0\101xD 3.0\Engine Hack Base\ClientDll\ClientDll.cpp(2003,18): warning C4477: 'sprintf' : format string '%i' requires an argument of type 'int', but variadic argument 2 has type 'double'
1>cvars.cpp
1>C:\Users\kosztapc\Desktop\forUCcheatssources_[unknowncheats.me]_\101xD 3.0\101xD 3.0\Engine Hack Base\ValveSDK\util.h(248,71): warning C4091: 'typedef ': ignored on left of '<unnamed-enum-point_hull>' when no variable is declared
1>C:\Program Files (x86)\Microsoft Visual Studio\2019\Professional\VC\Tools\MSVC\14.25.28610\include\cstdlib(24,18): error C2589: '(': illegal token on right side of '::'
1>C:\Program Files (x86)\Microsoft Visual Studio\2019\Professional\VC\Tools\MSVC\14.25.28610\include\cstdlib(24): error C2062: type 'unknown-type' unexpected
1>C:\Program Files (x86)\Microsoft Visual Studio\2019\Professional\VC\Tools\MSVC\14.25.28610\include\cstdlib(24,18): error C2059: syntax error: ')'
1>C:\Program Files (x86)\Microsoft Visual Studio\2019\Professional\VC\Tools\MSVC\14.25.28610\include\cmath(98,40): error C2062: type 'float' unexpected
1>C:\Program Files (x86)\Microsoft Visual Studio\2019\Professional\VC\Tools\MSVC\14.25.28610\include\cmath(98,40): error C2059: syntax error: 'constant'
1>C:\Program Files (x86)\Microsoft Visual Studio\2019\Professional\VC\Tools\MSVC\14.25.28610\include\cmath(98,40): error C2059: syntax error: ')'
1>C:\Program Files (x86)\Microsoft Visual Studio\2019\Professional\VC\Tools\MSVC\14.25.28610\include\cmath(98,89): error C2143: syntax error: missing ';' before '{'
1>C:\Program Files (x86)\Microsoft Visual Studio\2019\Professional\VC\Tools\MSVC\14.25.28610\include\cmath(98,89): error C2447: '{': missing function header (old-style formal list?)
1>C:\Program Files (x86)\Microsoft Visual Studio\2019\Professional\VC\Tools\MSVC\14.25.28610\include\cmath(332,46): error C2062: type 'long double' unexpected
1>C:\Program Files (x86)\Microsoft Visual Studio\2019\Professional\VC\Tools\MSVC\14.25.28610\include\cmath(332,46): error C2059: syntax error: 'constant'
1>C:\Program Files (x86)\Microsoft Visual Studio\2019\Professional\VC\Tools\MSVC\14.25.28610\include\cmath(332,46): error C2059: syntax error: ')'
1>C:\Program Files (x86)\Microsoft Visual Studio\2019\Professional\VC\Tools\MSVC\14.25.28610\include\cmath(332,101): error C2143: syntax error: missing ';' before '{'
1>C:\Program Files (x86)\Microsoft Visual Studio\2019\Professional\VC\Tools\MSVC\14.25.28610\include\cmath(332,101): error C2447: '{': missing function header (old-style formal list?)
1>C:\Program Files (x86)\Microsoft Visual Studio\2019\Professional\VC\Tools\MSVC\14.25.28610\include\cmath(643,1): error C2146: syntax error: missing ')' before identifier '_Left'
1>C:\Program Files (x86)\Microsoft Visual Studio\2019\Professional\VC\Tools\MSVC\14.25.28610\include\cmath(643,1): error C2365: '_Ty': redefinition; previous definition was 'template parameter'
1>C:\Program Files (x86)\Microsoft Visual Studio\2019\Professional\VC\Tools\MSVC\14.25.28610\include\cmath(643): message : see declaration of '_Ty'
1>C:\Program Files (x86)\Microsoft Visual Studio\2019\Professional\VC\Tools\MSVC\14.25.28610\include\cmath(643,1): error C2061: syntax error: identifier '_Left'
1>C:\Program Files (x86)\Microsoft Visual Studio\2019\Professional\VC\Tools\MSVC\14.25.28610\include\cmath(643,1): error C2059: syntax error: ')'
1>C:\Program Files (x86)\Microsoft Visual Studio\2019\Professional\VC\Tools\MSVC\14.25.28610\include\cmath(643,1): error C2988: unrecognizable template declaration/definition
1>C:\Program Files (x86)\Microsoft Visual Studio\2019\Professional\VC\Tools\MSVC\14.25.28610\include\cmath(643,1): error C2059: syntax error: 'constant'
1>C:\Program Files (x86)\Microsoft Visual Studio\2019\Professional\VC\Tools\MSVC\14.25.28610\include\cmath(643,1): error C2143: syntax error: missing ';' before '{'
1>C:\Program Files (x86)\Microsoft Visual Studio\2019\Professional\VC\Tools\MSVC\14.25.28610\include\cmath(643,1): error C2447: '{': missing function header (old-style formal list?)
1>nospread.cpp
1>C:\Users\kosztapc\Desktop\forUCcheatssources_[unknowncheats.me]_\101xD 3.0\101xD 3.0\Engine Hack Base\ValveSDK\util.h(248,71): warning C4091: 'typedef ': ignored on left of '<unnamed-enum-point_hull>' when no variable is declared
1>C:\Program Files (x86)\Microsoft Visual Studio\2019\Professional\VC\Tools\MSVC\14.25.28610\include\cstdlib(24,18): error C2589: '(': illegal token on right side of '::'
1>C:\Program Files (x86)\Microsoft Visual Studio\2019\Professional\VC\Tools\MSVC\14.25.28610\include\cstdlib(24): error C2062: type 'unknown-type' unexpected
1>C:\Program Files (x86)\Microsoft Visual Studio\2019\Professional\VC\Tools\MSVC\14.25.28610\include\cstdlib(24,18): error C2059: syntax error: ')'
1>C:\Program Files (x86)\Microsoft Visual Studio\2019\Professional\VC\Tools\MSVC\14.25.28610\include\cmath(98,40): error C2062: type 'float' unexpected
1>C:\Program Files (x86)\Microsoft Visual Studio\2019\Professional\VC\Tools\MSVC\14.25.28610\include\cmath(98,40): error C2059: syntax error: 'constant'
1>C:\Program Files (x86)\Microsoft Visual Studio\2019\Professional\VC\Tools\MSVC\14.25.28610\include\cmath(98,40): error C2059: syntax error: ')'
1>C:\Program Files (x86)\Microsoft Visual Studio\2019\Professional\VC\Tools\MSVC\14.25.28610\include\cmath(98,89): error C2143: syntax error: missing ';' before '{'
1>C:\Program Files (x86)\Microsoft Visual Studio\2019\Professional\VC\Tools\MSVC\14.25.28610\include\cmath(98,89): error C2447: '{': missing function header (old-style formal list?)
1>C:\Program Files (x86)\Microsoft Visual Studio\2019\Professional\VC\Tools\MSVC\14.25.28610\include\cmath(332,46): error C2062: type 'long double' unexpected
1>C:\Program Files (x86)\Microsoft Visual Studio\2019\Professional\VC\Tools\MSVC\14.25.28610\include\cmath(332,46): error C2059: syntax error: 'constant'
1>C:\Program Files (x86)\Microsoft Visual Studio\2019\Professional\VC\Tools\MSVC\14.25.28610\include\cmath(332,46): error C2059: syntax error: ')'
1>C:\Program Files (x86)\Microsoft Visual Studio\2019\Professional\VC\Tools\MSVC\14.25.28610\include\cmath(332,101): error C2143: syntax error: missing ';' before '{'
1>C:\Program Files (x86)\Microsoft Visual Studio\2019\Professional\VC\Tools\MSVC\14.25.28610\include\cmath(332,101): error C2447: '{': missing function header (old-style formal list?)
1>C:\Program Files (x86)\Microsoft Visual Studio\2019\Professional\VC\Tools\MSVC\14.25.28610\include\cmath(643,1): error C2146: syntax error: missing ')' before identifier '_Left'
1>C:\Program Files (x86)\Microsoft Visual Studio\2019\Professional\VC\Tools\MSVC\14.25.28610\include\cmath(643,1): error C2365: '_Ty': redefinition; previous definition was 'template parameter'
1>C:\Program Files (x86)\Microsoft Visual Studio\2019\Professional\VC\Tools\MSVC\14.25.28610\include\cmath(643): message : see declaration of '_Ty'
1>C:\Program Files (x86)\Microsoft Visual Studio\2019\Professional\VC\Tools\MSVC\14.25.28610\include\cmath(643,1): error C2061: syntax error: identifier '_Left'
1>C:\Program Files (x86)\Microsoft Visual Studio\2019\Professional\VC\Tools\MSVC\14.25.28610\include\cmath(643,1): error C2059: syntax error: ')'
1>C:\Program Files (x86)\Microsoft Visual Studio\2019\Professional\VC\Tools\MSVC\14.25.28610\include\cmath(643,1): error C2988: unrecognizable template declaration/definition
1>C:\Program Files (x86)\Microsoft Visual Studio\2019\Professional\VC\Tools\MSVC\14.25.28610\include\cmath(643,1): error C2059: syntax error: 'constant'
1>C:\Program Files (x86)\Microsoft Visual Studio\2019\Professional\VC\Tools\MSVC\14.25.28610\include\cmath(643,1): error C2143: syntax error: missing ';' before '{'
1>C:\Program Files (x86)\Microsoft Visual Studio\2019\Professional\VC\Tools\MSVC\14.25.28610\include\cmath(643,1): error C2447: '{': missing function header (old-style formal list?)
1>weaponslist.cpp
1>C:\Users\kosztapc\Desktop\forUCcheatssources_[unknowncheats.me]_\101xD 3.0\101xD 3.0\Engine Hack Base\ValveSDK\util.h(248,71): warning C4091: 'typedef ': ignored on left of '<unnamed-enum-point_hull>' when no variable is declared
1>C:\Program Files (x86)\Microsoft Visual Studio\2019\Professional\VC\Tools\MSVC\14.25.28610\include\cstdlib(24,18): error C2589: '(': illegal token on right side of '::'
1>C:\Program Files (x86)\Microsoft Visual Studio\2019\Professional\VC\Tools\MSVC\14.25.28610\include\cstdlib(24): error C2062: type 'unknown-type' unexpected
1>C:\Program Files (x86)\Microsoft Visual Studio\2019\Professional\VC\Tools\MSVC\14.25.28610\include\cstdlib(24,18): error C2059: syntax error: ')'
1>C:\Program Files (x86)\Microsoft Visual Studio\2019\Professional\VC\Tools\MSVC\14.25.28610\include\cmath(98,40): error C2062: type 'float' unexpected
1>C:\Program Files (x86)\Microsoft Visual Studio\2019\Professional\VC\Tools\MSVC\14.25.28610\include\cmath(98,40): error C2059: syntax error: 'constant'
1>C:\Program Files (x86)\Microsoft Visual Studio\2019\Professional\VC\Tools\MSVC\14.25.28610\include\cmath(98,40): error C2059: syntax error: ')'
1>C:\Program Files (x86)\Microsoft Visual Studio\2019\Professional\VC\Tools\MSVC\14.25.28610\include\cmath(98,89): error C2143: syntax error: missing ';' before '{'
1>C:\Program Files (x86)\Microsoft Visual Studio\2019\Professional\VC\Tools\MSVC\14.25.28610\include\cmath(98,89): error C2447: '{': missing function header (old-style formal list?)
1>C:\Program Files (x86)\Microsoft Visual Studio\2019\Professional\VC\Tools\MSVC\14.25.28610\include\cmath(332,46): error C2062: type 'long double' unexpected
1>C:\Program Files (x86)\Microsoft Visual Studio\2019\Professional\VC\Tools\MSVC\14.25.28610\include\cmath(332,46): error C2059: syntax error: 'constant'
1>C:\Program Files (x86)\Microsoft Visual Studio\2019\Professional\VC\Tools\MSVC\14.25.28610\include\cmath(332,46): error C2059: syntax error: ')'
1>C:\Program Files (x86)\Microsoft Visual Studio\2019\Professional\VC\Tools\MSVC\14.25.28610\include\cmath(332,101): error C2143: syntax error: missing ';' before '{'
1>C:\Program Files (x86)\Microsoft Visual Studio\2019\Professional\VC\Tools\MSVC\14.25.28610\include\cmath(332,101): error C2447: '{': missing function header (old-style formal list?)
1>C:\Program Files (x86)\Microsoft Visual Studio\2019\Professional\VC\Tools\MSVC\14.25.28610\include\cmath(643,1): error C2146: syntax error: missing ')' before identifier '_Left'
1>C:\Program Files (x86)\Microsoft Visual Studio\2019\Professional\VC\Tools\MSVC\14.25.28610\include\cmath(643,1): error C2365: '_Ty': redefinition; previous definition was 'template parameter'
1>C:\Program Files (x86)\Microsoft Visual Studio\2019\Professional\VC\Tools\MSVC\14.25.28610\include\cmath(643): message : see declaration of '_Ty'
1>C:\Program Files (x86)\Microsoft Visual Studio\2019\Professional\VC\Tools\MSVC\14.25.28610\include\cmath(643,1): error C2061: syntax error: identifier '_Left'
1>C:\Program Files (x86)\Microsoft Visual Studio\2019\Professional\VC\Tools\MSVC\14.25.28610\include\cmath(643,1): error C2059: syntax error: ')'
1>C:\Program Files (x86)\Microsoft Visual Studio\2019\Professional\VC\Tools\MSVC\14.25.28610\include\cmath(643,1): error C2988: unrecognizable template declaration/definition
1>C:\Program Files (x86)\Microsoft Visual Studio\2019\Professional\VC\Tools\MSVC\14.25.28610\include\cmath(643,1): error C2059: syntax error: 'constant'
1>C:\Program Files (x86)\Microsoft Visual Studio\2019\Professional\VC\Tools\MSVC\14.25.28610\include\cmath(643,1): error C2143: syntax error: missing ';' before '{'
1>C:\Program Files (x86)\Microsoft Visual Studio\2019\Professional\VC\Tools\MSVC\14.25.28610\include\cmath(643,1): error C2447: '{': missing function header (old-style formal list?)
1>OffsetScan.cpp
1>C:\Users\kosztapc\Desktop\forUCcheatssources_[unknowncheats.me]_\101xD 3.0\101xD 3.0\Engine Hack Base\ValveSDK\util.h(248,71): warning C4091: 'typedef ': ignored on left of '<unnamed-enum-point_hull>' when no variable is declared
1>C:\Program Files (x86)\Microsoft Visual Studio\2019\Professional\VC\Tools\MSVC\14.25.28610\include\cstdlib(24,18): error C2589: '(': illegal token on right side of '::'
1>C:\Program Files (x86)\Microsoft Visual Studio\2019\Professional\VC\Tools\MSVC\14.25.28610\include\cstdlib(24): error C2062: type 'unknown-type' unexpected
1>C:\Program Files (x86)\Microsoft Visual Studio\2019\Professional\VC\Tools\MSVC\14.25.28610\include\cstdlib(24,18): error C2059: syntax error: ')'
1>C:\Program Files (x86)\Microsoft Visual Studio\2019\Professional\VC\Tools\MSVC\14.25.28610\include\cmath(98,40): error C2062: type 'float' unexpected
1>C:\Program Files (x86)\Microsoft Visual Studio\2019\Professional\VC\Tools\MSVC\14.25.28610\include\cmath(98,40): error C2059: syntax error: 'constant'
1>C:\Program Files (x86)\Microsoft Visual Studio\2019\Professional\VC\Tools\MSVC\14.25.28610\include\cmath(98,40): error C2059: syntax error: ')'
1>C:\Program Files (x86)\Microsoft Visual Studio\2019\Professional\VC\Tools\MSVC\14.25.28610\include\cmath(98,89): error C2143: syntax error: missing ';' before '{'
1>C:\Program Files (x86)\Microsoft Visual Studio\2019\Professional\VC\Tools\MSVC\14.25.28610\include\cmath(98,89): error C2447: '{': missing function header (old-style formal list?)
1>C:\Program Files (x86)\Microsoft Visual Studio\2019\Professional\VC\Tools\MSVC\14.25.28610\include\cmath(332,46): error C2062: type 'long double' unexpected
1>C:\Program Files (x86)\Microsoft Visual Studio\2019\Professional\VC\Tools\MSVC\14.25.28610\include\cmath(332,46): error C2059: syntax error: 'constant'
1>C:\Program Files (x86)\Microsoft Visual Studio\2019\Professional\VC\Tools\MSVC\14.25.28610\include\cmath(332,46): error C2059: syntax error: ')'
1>C:\Program Files (x86)\Microsoft Visual Studio\2019\Professional\VC\Tools\MSVC\14.25.28610\include\cmath(332,101): error C2143: syntax error: missing ';' before '{'
1>C:\Program Files (x86)\Microsoft Visual Studio\2019\Professional\VC\Tools\MSVC\14.25.28610\include\cmath(332,101): error C2447: '{': missing function header (old-style formal list?)
1>C:\Program Files (x86)\Microsoft Visual Studio\2019\Professional\VC\Tools\MSVC\14.25.28610\include\cmath(643,1): error C2146: syntax error: missing ')' before identifier '_Left'
1>C:\Program Files (x86)\Microsoft Visual Studio\2019\Professional\VC\Tools\MSVC\14.25.28610\include\cmath(643,1): error C2365: '_Ty': redefinition; previous definition was 'template parameter'
1>C:\Program Files (x86)\Microsoft Visual Studio\2019\Professional\VC\Tools\MSVC\14.25.28610\include\cmath(643): message : see declaration of '_Ty'
1>C:\Program Files (x86)\Microsoft Visual Studio\2019\Professional\VC\Tools\MSVC\14.25.28610\include\cmath(643,1): error C2061: syntax error: identifier '_Left'
1>C:\Program Files (x86)\Microsoft Visual Studio\2019\Professional\VC\Tools\MSVC\14.25.28610\include\cmath(643,1): error C2059: syntax error: ')'
1>C:\Program Files (x86)\Microsoft Visual Studio\2019\Professional\VC\Tools\MSVC\14.25.28610\include\cmath(643,1): error C2988: unrecognizable template declaration/definition
1>C:\Program Files (x86)\Microsoft Visual Studio\2019\Professional\VC\Tools\MSVC\14.25.28610\include\cmath(643,1): error C2059: syntax error: 'constant'
1>C:\Program Files (x86)\Microsoft Visual Studio\2019\Professional\VC\Tools\MSVC\14.25.28610\include\cmath(643,1): error C2143: syntax error: missing ';' before '{'
1>C:\Program Files (x86)\Microsoft Visual Studio\2019\Professional\VC\Tools\MSVC\14.25.28610\include\cmath(643,1): error C2447: '{': missing function header (old-style formal list?)
1>C:\Users\kosztapc\Desktop\forUCcheatssources_[unknowncheats.me]_\101xD 3.0\101xD 3.0\Engine Hack Base\Offset Scan\OffsetScan.cpp(80,2): error C3861: '__halt': identifier not found
1>UserMsgs.cpp
1>C:\Users\kosztapc\Desktop\forUCcheatssources_[unknowncheats.me]_\101xD 3.0\101xD 3.0\Engine Hack Base\ValveSDK\util.h(248,71): warning C4091: 'typedef ': ignored on left of '<unnamed-enum-point_hull>' when no variable is declared
1>C:\Program Files (x86)\Microsoft Visual Studio\2019\Professional\VC\Tools\MSVC\14.25.28610\include\cstdlib(24,18): error C2589: '(': illegal token on right side of '::'
1>C:\Program Files (x86)\Microsoft Visual Studio\2019\Professional\VC\Tools\MSVC\14.25.28610\include\cstdlib(24): error C2062: type 'unknown-type' unexpected
1>C:\Program Files (x86)\Microsoft Visual Studio\2019\Professional\VC\Tools\MSVC\14.25.28610\include\cstdlib(24,18): error C2059: syntax error: ')'
1>C:\Program Files (x86)\Microsoft Visual Studio\2019\Professional\VC\Tools\MSVC\14.25.28610\include\cmath(98,40): error C2062: type 'float' unexpected
1>C:\Program Files (x86)\Microsoft Visual Studio\2019\Professional\VC\Tools\MSVC\14.25.28610\include\cmath(98,40): error C2059: syntax error: 'constant'
1>C:\Program Files (x86)\Microsoft Visual Studio\2019\Professional\VC\Tools\MSVC\14.25.28610\include\cmath(98,40): error C2059: syntax error: ')'
1>C:\Program Files (x86)\Microsoft Visual Studio\2019\Professional\VC\Tools\MSVC\14.25.28610\include\cmath(98,89): error C2143: syntax error: missing ';' before '{'
1>C:\Program Files (x86)\Microsoft Visual Studio\2019\Professional\VC\Tools\MSVC\14.25.28610\include\cmath(98,89): error C2447: '{': missing function header (old-style formal list?)
1>C:\Program Files (x86)\Microsoft Visual Studio\2019\Professional\VC\Tools\MSVC\14.25.28610\include\cmath(332,46): error C2062: type 'long double' unexpected
1>C:\Program Files (x86)\Microsoft Visual Studio\2019\Professional\VC\Tools\MSVC\14.25.28610\include\cmath(332,46): error C2059: syntax error: 'constant'
1>C:\Program Files (x86)\Microsoft Visual Studio\2019\Professional\VC\Tools\MSVC\14.25.28610\include\cmath(332,46): error C2059: syntax error: ')'
1>C:\Program Files (x86)\Microsoft Visual Studio\2019\Professional\VC\Tools\MSVC\14.25.28610\include\cmath(332,101): error C2143: syntax error: missing ';' before '{'
1>C:\Program Files (x86)\Microsoft Visual Studio\2019\Professional\VC\Tools\MSVC\14.25.28610\include\cmath(332,101): error C2447: '{': missing function header (old-style formal list?)
1>C:\Program Files (x86)\Microsoft Visual Studio\2019\Professional\VC\Tools\MSVC\14.25.28610\include\cmath(643,1): error C2146: syntax error: missing ')' before identifier '_Left'
1>C:\Program Files (x86)\Microsoft Visual Studio\2019\Professional\VC\Tools\MSVC\14.25.28610\include\cmath(643,1): error C2365: '_Ty': redefinition; previous definition was 'template parameter'
1>C:\Program Files (x86)\Microsoft Visual Studio\2019\Professional\VC\Tools\MSVC\14.25.28610\include\cmath(643): message : see declaration of '_Ty'
1>C:\Program Files (x86)\Microsoft Visual Studio\2019\Professional\VC\Tools\MSVC\14.25.28610\include\cmath(643,1): error C2061: syntax error: identifier '_Left'
1>C:\Program Files (x86)\Microsoft Visual Studio\2019\Professional\VC\Tools\MSVC\14.25.28610\include\cmath(643,1): error C2059: syntax error: ')'
1>C:\Program Files (x86)\Microsoft Visual Studio\2019\Professional\VC\Tools\MSVC\14.25.28610\include\cmath(643,1): error C2988: unrecognizable template declaration/definition
1>C:\Program Files (x86)\Microsoft Visual Studio\2019\Professional\VC\Tools\MSVC\14.25.28610\include\cmath(643,1): error C2059: syntax error: 'constant'
1>C:\Program Files (x86)\Microsoft Visual Studio\2019\Professional\VC\Tools\MSVC\14.25.28610\include\cmath(643,1): error C2143: syntax error: missing ';' before '{'
1>C:\Program Files (x86)\Microsoft Visual Studio\2019\Professional\VC\Tools\MSVC\14.25.28610\include\cmath(643,1): error C2447: '{': missing function header (old-style formal list?)
1>Done building project "Engine Hack Base.vcxproj" -- FAILED.
========== Build: 0 succeeded, 1 failed, 0 up-to-date, 0 skipped ==========

 

Share this post


Link to post
Share on other sites

Join the conversation

You can post now and register later. If you have an account, sign in now to post with your account.
Note: Your post will require moderator approval before it will be visible.

Guest
Reply to this topic...

×   Pasted as rich text.   Paste as plain text instead

  Only 75 emoji are allowed.

×   Your link has been automatically embedded.   Display as a link instead

×   Your previous content has been restored.   Clear editor

×   You cannot paste images directly. Upload or insert images from URL.

Loading...
Sign in to follow this  

×
×
  • Create New...